BDBM50096111 2-(3-Carbamimidoyl-phenyl)-5-trifluoromethyl-2H-pyrazole-3-carboxylic acid (2'-sulfamoyl-biphenyl-4-yl)-amide::CHEMBL347846
SMILES NC(=N)c1cccc(c1)-n1nc(cc1C(=O)Nc1ccc(cc1)-c1ccccc1S(N)(=O)=O)C(F)(F)F
InChI Key InChIKey=LAOYKAPCPZXMLS-UHFFFAOYSA-N
Data  3 KI
  Tab Delimited (TSV)   2D SDfile   Computed 3D by Vconf -m prep SDfile
Find this compound or compounds like it in BindingDB:
Activity Spreadsheet -- Enzyme Inhibition Constant Data from BindingDB
Found 1 hit for monomerid = 50096111
TargetCoagulation factor X(Homo sapiens (Human))
Dupont Pharmaceuticals
Curated by ChEMBL
LigandPNGBDBM50096111(2-(3-Carbamimidoyl-phenyl)-5-trifluoromethyl-2H-py...)
Affinity DataKi:  0.0150nM. Assay description: Binding affinity against human coagulation factor X
In DepthDetails ArticlePubMed